formating issues fixed

6 jobs for more_fuzz_tests in 6 minutes and 20 seconds (queued for 33 seconds)
Status Job ID Name Coverage
  Test
failed #29555
allowed to fail
groupA

00:01:47

failed #29556
allowed to fail
groupB

00:04:53

failed #29557
allowed to fail
groupC

00:03:08

failed #29558
allowed to fail
groupD

00:01:57

failed #29559
allowed to fail
groupE

00:02:44

passed #29554
style

00:00:22

 
Name Stage Failure
failed
groupE Test
  File "/builds/sre18/break-it/util/BaseTest.py", line 35, in assertValueListEqual
raise self.failureException("{} not in {}: {}".format(value, expected_list, msg))
AssertionError: 500 not in [252]: Message <b'VRFY leonard@marschke.me\r\n'>

----------------------------------------------------------------------
Ran 40 tests in 21.289s

FAILED (failures=22)
ERROR: Job failed: exit code 1
failed
groupB Test
  File "/builds/sre18/break-it/util/BaseTest.py", line 35, in assertValueListEqual
raise self.failureException("{} not in {}: {}".format(value, expected_list, msg))
AssertionError: 502 not in [252]: Message <b'VRFY leonard@marschke.me\r\n'>

----------------------------------------------------------------------
Ran 40 tests in 71.924s

FAILED (failures=34, errors=1)
ERROR: Job failed: exit code 1
failed
groupD Test
  File "/builds/sre18/break-it/util/BaseTest.py", line 35, in assertValueListEqual
raise self.failureException("{} not in {}: {}".format(value, expected_list, msg))
AssertionError: 500 not in [252]: Message <b'VRFY leonard@marschke.me\r\n'>

----------------------------------------------------------------------
Ran 40 tests in 32.176s

FAILED (failures=30)
ERROR: Job failed: exit code 1
failed
groupC Test
  File "/builds/sre18/break-it/util/BaseTest.py", line 35, in assertValueListEqual
raise self.failureException("{} not in {}: {}".format(value, expected_list, msg))
AssertionError: 500 not in [252]: Message <b'VRFY leonard@marschke.me\r\n'>

----------------------------------------------------------------------
Ran 40 tests in 37.527s

FAILED (failures=30, errors=2)
ERROR: Job failed: exit code 1
failed
groupA Test
  File "/builds/sre18/break-it/util/BaseTest.py", line 62, in assertResponse
raise self.failureException("Timeout with message <{}>".format(format_message(message)))
AssertionError: Timeout with message <AAAAAAAAAAAAAAAAAAAAAAAAAAAAAAAAAAAAAAAAAAAAAAAAAA ..[999900x].. AAAAAAAAAAAAAAAAAAAAAAAAAAAAAAAAAAAAAAAAAAAAAAAAAA>

----------------------------------------------------------------------
Ran 40 tests in 31.879s

FAILED (failures=1)
ERROR: Job failed: exit code 1