Merge branch 'drop-tests' into 'master'

Drops test

See merge request sre18/break-it!10
6 jobs for master in 7 minutes and 16 seconds (queued for 1 second)
Status Job ID Name Coverage
  Test
passed #29358
allowed to fail
groupA

00:02:56

failed #29359
allowed to fail
groupB

00:07:16

failed #29360
allowed to fail
groupC

00:02:23

failed #29361
allowed to fail
groupD

00:02:48

failed #29362
allowed to fail
groupE

00:01:43

passed #29357
style

00:02:25

 
Name Stage Failure
failed
groupB Test
  File "/builds/sre18/break-it/util/BaseTest.py", line 35, in assertValueListEqual
raise self.failureException("{} not in {}: {}".format(value, expected_list, msg))
AssertionError: 502 not in [252]: Message <b'VRFY leonard@marschke.me\r\n'>

----------------------------------------------------------------------
Ran 34 tests in 21.699s

FAILED (failures=28, errors=1)
ERROR: Job failed: exit code 1
failed
groupE Test
  File "/builds/sre18/break-it/util/BaseTest.py", line 35, in assertValueListEqual
raise self.failureException("{} not in {}: {}".format(value, expected_list, msg))
AssertionError: 500 not in [252]: Message <b'VRFY leonard@marschke.me\r\n'>

----------------------------------------------------------------------
Ran 34 tests in 11.411s

FAILED (failures=19)
ERROR: Job failed: exit code 1
failed
groupD Test
  File "/builds/sre18/break-it/util/BaseTest.py", line 35, in assertValueListEqual
raise self.failureException("{} not in {}: {}".format(value, expected_list, msg))
AssertionError: 500 not in [252]: Message <b'VRFY leonard@marschke.me\r\n'>

----------------------------------------------------------------------
Ran 34 tests in 11.791s

FAILED (failures=26)
ERROR: Job failed: exit code 1
failed
groupC Test
  File "/builds/sre18/break-it/util/BaseTest.py", line 35, in assertValueListEqual
raise self.failureException("{} not in {}: {}".format(value, expected_list, msg))
AssertionError: 500 not in [252]: Message <b'VRFY leonard@marschke.me\r\n'>

----------------------------------------------------------------------
Ran 34 tests in 35.030s

FAILED (failures=24, errors=3)
ERROR: Job failed: exit code 1