added list for error codes

6 jobs for code_list in 6 minutes and 20 seconds (queued for 7 minutes and 11 seconds)
Status Job ID Name Coverage
  Test
failed #29190
allowed to fail
groupA

00:00:50

failed #29191
allowed to fail
groupB

00:05:05

failed #29192
allowed to fail
groupC

00:01:47

failed #29193
allowed to fail
groupD

00:02:42

failed #29194
allowed to fail
groupE

00:01:53

failed #29189
style

00:00:24

 
Name Stage Failure
failed
groupB Test
  File "/builds/sre18/break-it/util/BaseTest.py", line 22, in assertValueListEqual
raise self.failureException("{} not in {}: {}".format(value, expected_list, msg))
AssertionError: 502 not in [252]: Message <b'VRFY leonard@marschke.me\r\n'>

----------------------------------------------------------------------
Ran 33 tests in 20.302s

FAILED (failures=27, errors=1)
ERROR: Job failed: exit code 1
failed
groupE Test
  File "/builds/sre18/break-it/util/BaseTest.py", line 22, in assertValueListEqual
raise self.failureException("{} not in {}: {}".format(value, expected_list, msg))
AssertionError: 500 not in [252]: Message <b'VRFY leonard@marschke.me\r\n'>

----------------------------------------------------------------------
Ran 33 tests in 10.720s

FAILED (failures=18)
ERROR: Job failed: exit code 1
failed
groupD Test
  File "/builds/sre18/break-it/util/BaseTest.py", line 22, in assertValueListEqual
raise self.failureException("{} not in {}: {}".format(value, expected_list, msg))
AssertionError: 500 not in [252]: Message <b'VRFY leonard@marschke.me\r\n'>

----------------------------------------------------------------------
Ran 33 tests in 11.800s

FAILED (failures=25)
ERROR: Job failed: exit code 1
failed
groupC Test
  File "/builds/sre18/break-it/util/BaseTest.py", line 52, in assertResponse
expected_code, message))
AssertionError: No code raised, but expected [220], message <None>

----------------------------------------------------------------------
Ran 33 tests in 5.329s

FAILED (failures=1, errors=29)
ERROR: Job failed: exit code 1
failed
groupA Test
  File "/usr/lib/python3.5/subprocess.py", line 708, in run
output=stdout, stderr=stderr)
subprocess.CalledProcessError: Command '['docker', 'exec', 'ce477a42cae73dbbe5603075475af90a05bc9708e15a1310e4dd291fad46ff3e', 'grep', '-r', 'SOME_RANDOM_TEXT']' returned non-zero exit status 1

----------------------------------------------------------------------
Ran 33 tests in 8.482s

FAILED (errors=1)
ERROR: Job failed: exit code 1
failed
style Test
+-------------+------------+




-----------------------------------
Your code has been rated at 9.96/10

ERROR: Job failed: exit code 1