Fixed infinite recursion

6 jobs for drop-tests in 5 minutes and 15 seconds (queued for 2 seconds)
Status Job ID Name Coverage
  Test
failed #29159
allowed to fail
groupA

00:01:00

failed #29160
allowed to fail
groupB

00:05:15

failed #29161
allowed to fail
groupC

00:01:51

failed #29162
allowed to fail
groupD

00:02:58

failed #29163
allowed to fail
groupE

00:02:05

passed #29158
style

00:00:20

 
Name Stage Failure
failed
groupB Test
  File "/builds/sre18/break-it/util/BaseTest.py", line 42, in assertResponse
self.assertEqual(int(response[:3]), expectedCode, msg="Message <{}>".format(format_message(message)))
AssertionError: 502 != 252 : Message <b'VRFY leonard@marschke.me\r\n'>

----------------------------------------------------------------------
Ran 34 tests in 21.606s

FAILED (failures=29, errors=1)
ERROR: Job failed: exit code 1
failed
groupE Test
  File "/builds/sre18/break-it/util/BaseTest.py", line 42, in assertResponse
self.assertEqual(int(response[:3]), expectedCode, msg="Message <{}>".format(format_message(message)))
AssertionError: 500 != 252 : Message <b'VRFY leonard@marschke.me\r\n'>

----------------------------------------------------------------------
Ran 34 tests in 11.488s

FAILED (failures=19)
ERROR: Job failed: exit code 1
failed
groupD Test
  File "/builds/sre18/break-it/util/BaseTest.py", line 42, in assertResponse
self.assertEqual(int(response[:3]), expectedCode, msg="Message <{}>".format(format_message(message)))
AssertionError: 500 != 252 : Message <b'VRFY leonard@marschke.me\r\n'>

----------------------------------------------------------------------
Ran 34 tests in 11.792s

FAILED (failures=26)
ERROR: Job failed: exit code 1
failed
groupC Test
  File "/builds/sre18/break-it/util/BaseTest.py", line 40, in assertResponse
expectedCode, format_message(message)))
AssertionError: No code raised, but expected 220, message <None>

----------------------------------------------------------------------
Ran 34 tests in 1.255s

FAILED (failures=2, errors=32)
ERROR: Job failed: exit code 1
failed
groupA Test
  File "/usr/lib/python3.5/subprocess.py", line 708, in run
output=stdout, stderr=stderr)
subprocess.CalledProcessError: Command '['docker', 'exec', '9c473761be2ae3300d1bf1821c6ad8b933e5094d044787c187b9bcbeef4bf8f0', 'grep', '-r', 'SOME_RANDOM_TEXT']' returned non-zero exit status 1

----------------------------------------------------------------------
Ran 34 tests in 9.736s

FAILED (errors=1)
ERROR: Job failed: exit code 1